Reaction Details
TargetGastrin-releasing peptide receptor
LigandBDBM85486
Substrate/Competitorn/a
Ki 2±n/a nM
CommentsPDSP_754
Citation Katsuno, TPradhan, TKRyan, RRMantey, SAHou, WDonohue, PJAkeson, MASpindel, ERBattey, JFCoy, DHJensen, RT Pharmacology and cell biology of the bombesin receptor subtype 4 (BB4-R). Biochemistry38:7307-20 (1999) 
 
Gastrin-releasing peptide receptor
Name:Gastrin-releasing peptide receptor
Type:Enzyme Catalytic Domain
Mol. Mass.:43227.55
Organism:RAT
Description:Gastrin-Releasing peptide 0 RAT::P52500
Residue:384
BDBM85486
NameBDBM85486
Synonyms:DPhe6-Bn[6-14)
TypeSmall organic molecule
Emp. Form.C52H74N14O10S
Mol. Mass.1087.297
SMILESCSCC[C@H](NC(=O)[C@H](CC(C)C)NC(=O)[C@H](Cc1cnc[nH]1)NC(=O)CNC(=O)[C@@H](NC(=O)[C@H](C)NC(=O)[C@H](Cc1c[nH]c2ccccc12)NC(=O)[C@H](CCC(N)=O)NC(=O)[C@H](N)Cc1ccccc1)C(C)C)C(N)=O