Reaction Details
TargetGastrin-releasing peptide receptor
LigandBDBM85481
Substrate/Competitorn/a
Ki 1.24±n/a nM
CommentsPDSP_893
Citation Katsuno, TPradhan, TKRyan, RRMantey, SAHou, WDonohue, PJAkeson, MASpindel, ERBattey, JFCoy, DHJensen, RT Pharmacology and cell biology of the bombesin receptor subtype 4 (BB4-R). Biochemistry38:7307-20 (1999) 
 
Gastrin-releasing peptide receptor
Name:Gastrin-releasing peptide receptor
Type:Enzyme Catalytic Domain
Mol. Mass.:43234.59
Organism:MOUSE
Description:Gastrin-Releasing peptide 0 MOUSE::P21729
Residue:384
BDBM85481
NameBDBM85481
Synonyms:CAS_93755-85-2 | GRP
TypeSmall organic molecule
Emp. Form.C130H204N38O31S2
Mol. Mass.2859.377
SMILESCSCCC(NC(=O)C(CC(C)C)NC(=O)C(Cc1cnc[nH]1)NC(=O)CNC(=O)C(NC(=O)C(C)NC(=O)C(Cc1c[nH]c2ccccc12)NC(=O)C(Cc1cnc[nH]1)NC(=O)C(CC(N)=O)NC(=O)CNC(=O)C(CCCN=C(N)N)NC(=O)C1CCCN1C(=O)C(Cc1ccc(O)cc1)NC(=O)C(CCSC)NC(=O)C(CCCCN)NC(=O)C(NC(=O)C(CC(C)C)NC(=O)C(NC(=O)C(NC(=O)CNC(=O)CNC(=O)CNC(=O)C(C)NC(=O)C1CCCN1C(=O)C(CC(C)C)NC(=O)C1CCCN1C(=O)C(N)C(C)C)C(C)O)C(C)C)C(C)O)C(C)C)C(N)=O