Reaction Details
TargetGastrin-releasing peptide receptor
LigandBDBM81964
Substrate/Competitorn/a
Ki 20±n/a nM
CommentsPDSP_1305
Citation Katsuno, TPradhan, TKRyan, RRMantey, SAHou, WDonohue, PJAkeson, MASpindel, ERBattey, JFCoy, DHJensen, RT Pharmacology and cell biology of the bombesin receptor subtype 4 (BB4-R). Biochemistry38:7307-20 (1999) 
 
Gastrin-releasing peptide receptor
Name:Gastrin-releasing peptide receptor
Type:Enzyme Catalytic Domain
Mol. Mass.:43227.55
Organism:RAT
Description:Gastrin-Releasing peptide 0 RAT::P52500
Residue:384
BDBM81964
NameBDBM81964
Synonyms:CAS_5486814 NSC_5486814 | Neuromedin C
TypeSmall organic molecule
Emp. Form.C50H73N17O11S
Mol. Mass.1120.287
SMILESCSCCC(NC(=O)C(CC(C)C)NC(=O)C(Cc1cnc[nH]1)NC(=O)CNC(=O)C(NC(=O)C(C)NC(=O)C(Cc1c[nH]c2ccccc12)NC(=O)C(Cc1cnc[nH]1)NC(=O)C(CC(N)=O)NC(=O)CN)C(C)C)C(N)=O