Reaction Details
TargetGastrin-releasing peptide receptor
LigandBDBM50071754
Substrate/Competitorn/a
Ki 134±n/a nM
CommentsPDSP_1339
Citation Katsuno, TPradhan, TKRyan, RRMantey, SAHou, WDonohue, PJAkeson, MASpindel, ERBattey, JFCoy, DHJensen, RT Pharmacology and cell biology of the bombesin receptor subtype 4 (BB4-R). Biochemistry38:7307-20 (1999) 
 
Gastrin-releasing peptide receptor
Name:Gastrin-releasing peptide receptor
Type:Enzyme Catalytic Domain
Mol. Mass.:43234.59
Organism:MOUSE
Description:Gastrin-Releasing peptide 0 MOUSE::P21729
Residue:384
BDBM50071754
NameBDBM50071754
Synonyms:(S)-2-[3-(2,6-Diisopropyl-phenyl)-ureido]-3-(1H-indol-3-yl)-2-methyl-N-(1-pyridin-2-yl-cyclohexylmethyl)-propionamide NMB | Xenopus NMB
TypeSmall organic molecule
Emp. Form.C37H47N5O2
Mol. Mass.593.8014
SMILESCC(C)c1cccc(C(C)C)c1NC(=O)N[C@@](C)(Cc1c[nH]c2ccccc12)C(=O)NCC1(CCCCC1)c1ccccn1