Reaction Details
TargetNeuromedin-B receptor
LigandBDBM85499
Substrate/Competitorn/a
Ki 13±n/a nM
CommentsPDSP_1587
Citation Katsuno, TPradhan, TKRyan, RRMantey, SAHou, WDonohue, PJAkeson, MASpindel, ERBattey, JFCoy, DHJensen, RT Pharmacology and cell biology of the bombesin receptor subtype 4 (BB4-R). Biochemistry38:7307-20 (1999) 
 
Neuromedin-B receptor
Name:Neuromedin-B receptor
Type:Enzyme Catalytic Domain
Mol. Mass.:43540.92
Organism:RAT
Description:NMB 0 RAT::P24053
Residue:390
BDBM85499
NameBDBM85499
Synonyms:CAS_29451-71-6 Ranatensin
TypeSmall organic molecule
Emp. Form.C61H84N16O13S
Mol. Mass.1281.484
SMILESCSCCC(NC(=O)C(Cc1ccccc1)NC(=O)C(Cc1cnc[nH]1)NC(=O)CNC(=O)C(NC(=O)C(C)NC(=O)C(Cc1c[nH]c2ccccc12)NC(=O)C(CCC(N)=O)NC(=O)C1CCCN1C(=O)C(NC(=O)C1CCC(=O)N1)C(C)C)C(C)C)C(N)=O