Reaction Details
TargetProstaglandin G/H synthase 1
LigandBDBM50097346
Substrate/Competitorn/a
Ki 87±n/a nM
CommentsPDSP_4454
Citation Warner, TDGiuliano, FVojnovic, IBukasa, AMitchell, JAVane, JR Nonsteroid drug selectivities for cyclo-oxygenase-1 rather than cyclo-oxygenase-2 are associated with human gastrointestinal toxicity: a full in vitro analysis. Proc Natl Acad Sci U S A96:7563-8 (1999) 
 
Prostaglandin G/H synthase 1
Name:Prostaglandin G/H synthase 1
Type:Enzyme
Mol. Mass.:68692.62
Organism:Homo sapiens (Human)
Description:P23219
Residue:599
BDBM50097346
NameBDBM50097346
Synonyms:(+/-)-2-(3-chloro-9H-carbazol-7-yl)propanoic acid 2-(6-Chloro-9H-carbazol-2-yl)-propionic acid(carprofen) CARPROFEN Rimadyl | Ro-20-5720/000
TypeSmall organic molecule
Emp. Form.C15H12ClNO2
Mol. Mass.273.714
SMILESCC(C(O)=O)c1ccc2c(c1)[nH]c1ccc(Cl)cc21