Reaction Details
TargetProstaglandin G/H synthase 1
LigandBDBM50022772
Substrate/Competitorn/a
Ki>10000±n/a nM
CommentsPDSP_4468
Citation Warner, TDGiuliano, FVojnovic, IBukasa, AMitchell, JAVane, JR Nonsteroid drug selectivities for cyclo-oxygenase-1 rather than cyclo-oxygenase-2 are associated with human gastrointestinal toxicity: a full in vitro analysis. Proc Natl Acad Sci U S A96:7563-8 (1999) 
 
Prostaglandin G/H synthase 1
Name:Prostaglandin G/H synthase 1
Type:Enzyme
Mol. Mass.:68692.62
Organism:Homo sapiens (Human)
Description:P23219
Residue:599
BDBM50022772
NameBDBM50022772
Synonyms:CHEMBL1025 Diisopropyl fluorophosphonate Diisopropyl phosphorofluoridate Diisopropylfluorophosphoric acid ester Fluorodiisopropyl phosphate Isofluorphate Isopropyl fluophosphate Neoglaucit bis(propan-2-yl) fluorophosphate | diisopropyl fluorophosphate
TypeSmall organic molecule
Emp. Form.C6H14FO3P
Mol. Mass.184.1457
SMILESCC(C)OP(F)(=O)OC(C)C