Reaction Details
TargetProstaglandin G/H synthase 1
LigandBDBM50009859
Substrate/Competitorn/a
Ki 7600±n/a nM
CommentsPDSP_3993
Citation Warner, TDGiuliano, FVojnovic, IBukasa, AMitchell, JAVane, JR Nonsteroid drug selectivities for cyclo-oxygenase-1 rather than cyclo-oxygenase-2 are associated with human gastrointestinal toxicity: a full in vitro analysis. Proc Natl Acad Sci U S A96:7563-8 (1999) 
 
Prostaglandin G/H synthase 1
Name:Prostaglandin G/H synthase 1
Type:Enzyme
Mol. Mass.:68692.62
Organism:Homo sapiens (Human)
Description:P23219
Residue:599
BDBM50009859
NameBDBM50009859
Synonyms:(+-)-2-(p-isobutylphenyl)propionic acid (+-)-ibuprofen (4-isobutylphenyl)-alpha-methylacetic acid 2-(4-isobutylphenyl)propanoic acid 4-isobutylhydratropic acid Brufen IBUPROFEN LYSINE Ibuprofen (1) alpha-(4-isobutylphenyl)propionic acid | alpha-(p-isobutylphenyl)propionic acid
TypeSmall organic molecule
Emp. Form.C13H18O2
Mol. Mass.206.2808
SMILESCC(C)Cc1ccc(cc1)C(C)C(O)=O