Reaction Details
TargetProstaglandin G/H synthase 2
LigandBDBM50029603
Substrate/Competitorn/a
Ki 8600±n/a nM
CommentsPDSP_4469
Citation Warner, TDGiuliano, FVojnovic, IBukasa, AMitchell, JAVane, JR Nonsteroid drug selectivities for cyclo-oxygenase-1 rather than cyclo-oxygenase-2 are associated with human gastrointestinal toxicity: a full in vitro analysis. Proc Natl Acad Sci U S A96:7563-8 (1999) 
 
Prostaglandin G/H synthase 2
Name:Prostaglandin G/H synthase 2
Type:Enzyme
Mol. Mass.:69003.89
Organism:Homo sapiens (Human)
Description:Recombinant Cox-2 provided by Cayman (Cayman Chemical Co.,Ann Arbor, MI).
Residue:604
BDBM50029603
NameBDBM50029603
Synonyms:CHEMBL287919 L745,337 | N-[6-(2,4-Difluoro-phenylsulfanyl)-1-oxo-indan-5-yl]-methanesulfonamide
TypeSmall organic molecule
Emp. Form.C16H13F2NO3S2
Mol. Mass.369.406
SMILESCS(=O)(=O)Nc1cc2CCC(=O)c2cc1Sc1ccc(F)cc1F