Reaction Details
TargetProstaglandin G/H synthase 2
LigandBDBM22971
Substrate/Competitorn/a
Ki 200±n/a nM
CommentsPDSP_4459
Citation Warner, TDGiuliano, FVojnovic, IBukasa, AMitchell, JAVane, JR Nonsteroid drug selectivities for cyclo-oxygenase-1 rather than cyclo-oxygenase-2 are associated with human gastrointestinal toxicity: a full in vitro analysis. Proc Natl Acad Sci U S A96:7563-8 (1999) 
 
Prostaglandin G/H synthase 2
Name:Prostaglandin G/H synthase 2
Type:Enzyme
Mol. Mass.:69003.89
Organism:Homo sapiens (Human)
Description:Recombinant Cox-2 provided by Cayman (Cayman Chemical Co.,Ann Arbor, MI).
Residue:604
BDBM22971
NameBDBM22971
Synonyms:2-[(2,6-dichloro-3-methylphenyl)amino]benzoic acid Meclofenamate US11337935, Compound Meclofenamic-acid | US20240002326, Compound Meclofenamic acid
TypeSmall organic molecule
Emp. Form.C14H11Cl2NO2
Mol. Mass.296.149
SMILESCc1ccc(Cl)c(Nc2ccccc2C(O)=O)c1Cl