Reaction Details
TargetProstaglandin G/H synthase 2
LigandBDBM50056998
Substrate/Competitorn/a
Ki 230±n/a nM
CommentsPDSP_3995
Citation Warner, TDGiuliano, FVojnovic, IBukasa, AMitchell, JAVane, JR Nonsteroid drug selectivities for cyclo-oxygenase-1 rather than cyclo-oxygenase-2 are associated with human gastrointestinal toxicity: a full in vitro analysis. Proc Natl Acad Sci U S A96:7563-8 (1999) 
 
Prostaglandin G/H synthase 2
Name:Prostaglandin G/H synthase 2
Type:Enzyme
Mol. Mass.:69003.89
Organism:Homo sapiens (Human)
Description:Recombinant Cox-2 provided by Cayman (Cayman Chemical Co.,Ann Arbor, MI).
Residue:604
BDBM50056998
NameBDBM50056998
Synonyms:4-Hydroxy-1,1-dioxo-1,2-dihydro-1lambda*6*-benzo[e][1,2]thiazine-3-carboxylic acid (5-methyl-thiazol-2-yl)-amide CHEMBL599 Meloxicam sodium UH-AC 62XX | UHAC-62XX
TypeSmall organic molecule
Emp. Form.C14H13N3O4S2
Mol. Mass.351.401
SMILESCN1C(C(=O)Nc2ncc(C)s2)=C(O)c2ccccc2S1(=O)=O