Reaction Details
TargetProstaglandin G/H synthase 2
LigandBDBM85512
Substrate/Competitorn/a
Ki>10000±n/a nM
CommentsPDSP_4466
Citation Warner, TDGiuliano, FVojnovic, IBukasa, AMitchell, JAVane, JR Nonsteroid drug selectivities for cyclo-oxygenase-1 rather than cyclo-oxygenase-2 are associated with human gastrointestinal toxicity: a full in vitro analysis. Proc Natl Acad Sci U S A96:7563-8 (1999) 
 
Prostaglandin G/H synthase 2
Name:Prostaglandin G/H synthase 2
Type:Enzyme
Mol. Mass.:69003.89
Organism:Homo sapiens (Human)
Description:Recombinant Cox-2 provided by Cayman (Cayman Chemical Co.,Ann Arbor, MI).
Residue:604
BDBM85512
NameBDBM85512
Synonyms:CAS_76145-76-1 Tomoxiprol
TypeSmall organic molecule
Emp. Form.C21H20N2O
Mol. Mass.316.3963
SMILESCOc1ccc(cc1)-c1nc2c([nH]1)c(cc1ccccc21)C(C)C