Reaction Details
Target5-hydroxytryptamine receptor 2C
LigandBDBM25870
Substrate/Competitorn/a
Ki 630±n/a nM
CommentsPDSP_532
Citation Sánchez, CHyttel, J Comparison of the effects of antidepressants and their metabolites on reuptake of biogenic amines and on receptor binding. Cell Mol Neurobiol19:467-89 (1999) 
 
5-hydroxytryptamine receptor 2C
Name:5-hydroxytryptamine receptor 2C
Type:Enzyme
Mol. Mass.:51935.10
Organism:Rattus norvegicus (Rat)
Description:P08909
Residue:460
BDBM25870
NameBDBM25870
Synonyms:1-[3-(dimethylamino)propyl]-1-(4-fluorophenyl)-1,3-dihydro-2-benzofuran-5-carbonitrile CITALOPRAM Escitalopram [3H]Cytalopram [3H]Lexapro
Typeradiolabeled ligand
Emp. Form.C20H21FN2O
Mol. Mass.324.3919
SMILESCN(C)CCCC1(OCc2cc(ccc12)C#N)c1ccc(F)cc1