Reaction Details
TargetD(1A) dopamine receptor
LigandBDBM50069447
Substrate/Competitorn/a
Ki 1500±n/a nM
CommentsPDSP_1303
Citation Sánchez, CHyttel, J Comparison of the effects of antidepressants and their metabolites on reuptake of biogenic amines and on receptor binding. Cell Mol Neurobiol19:467-89 (1999) 
 
D(1A) dopamine receptor
Name:D(1A) dopamine receptor
Type:Enzyme Catalytic Domain
Mol. Mass.:49429.75
Organism:RAT
Description:P18901
Residue:446
BDBM50069447
NameBDBM50069447
Synonyms:1-(3-(4-(m-Chlorophenyl)-1-piperazinyl)propyl)-3-ethyl-4-(2-phenoxyethyl)-delta2-1,2,4-triazolin-5-one CHEMBL623 US9138393, Nefazodone HCl | US9144538, Nefazodone HCl
TypeSmall organic molecule
Emp. Form.C25H32ClN5O2
Mol. Mass.470.007
SMILESCCc1nn(CCCN2CCN(CC2)c2cccc(Cl)c2)c(=O)n1CCOc1ccccc1