Reaction Details
TargetProteinase-activated receptor 2
LigandBDBM85518
Substrate/Competitorn/a
Ki 260±n/a nM
CommentsPDSP_1793
Citation Al-Ani, BSaifeddine, MKawabata, ARenaux, BMokashi, SHollenberg, MD Proteinase-activated receptor 2 (PAR(2)): development of a ligand-binding assay correlating with activation of PAR(2) by PAR(1)- and PAR(2)-derived peptide ligands. J Pharmacol Exp Ther290:753-60 (1999) Proteinase-activated receptor 2
Name:Proteinase-activated receptor 2
Type:Enzyme Catalytic Domain
Mol. Mass.:44466.34
Organism:RAT
Description:PAR2 F2RL1 RAT::Q63645
Residue:397
BDBM85518
NameBDBM85518
Synonyms:tc-NH2 | trans-cinnamoyl-LIGRLO-NH2
TypeSmall organic molecule
Emp. Form.C40H67N11O7
Mol. Mass.814.0295
SMILESCC[C@H](C)[C@H](NC(=O)[C@H](CC(C)C)NC(=O)C=Cc1ccccc1)C(=O)NCC(=O)N[C@@H](CCCNC(N)=N)C(=O)N[C@@H](CC(C)C)C(=O)N[C@@H](CCCN)C(N)=O