Reaction Details
TargetSomatostatin receptor type 4
LigandBDBM50136767
Substrate/Competitorn/a
Ki 0.7±n/a nM
CommentsPDSP_3371
Citation Patel, YC Somatostatin and its receptor family. Front Neuroendocrinol20:157-98 (1999) 
 
Somatostatin receptor type 4
Name:Somatostatin receptor type 4
Type:Enzyme
Mol. Mass.:42015.38
Organism:Homo sapiens (Human)
Description:P31391
Residue:388
BDBM50136767
NameBDBM50136767
Synonyms:2-[4-(5,7-Difluoro-2-phenyl-1H-indol-3-yl)-butyrylamino]-5-guanidino-pentanoic acid methyl ester L-803,087
TypeSmall organic molecule
Emp. Form.C25H29F2N5O3
Mol. Mass.485.5263
SMILESCOC(=O)C(CCCNC(N)=N)NC(=O)CCCc1c([nH]c2c(F)cc(F)cc12)-c1ccccc1