Reaction Details
TargetSomatostatin receptor type 5
LigandBDBM50063821
Substrate/Competitorn/a
Ki 0.6±n/a nM
CommentsPDSP_3363
Citation Patel, YC Somatostatin and its receptor family. Front Neuroendocrinol20:157-98 (1999) 
 
Somatostatin receptor type 5
Name:Somatostatin receptor type 5
Type:Enzyme
Mol. Mass.:39218.02
Organism:Homo sapiens (Human)
Description:P35346
Residue:364
BDBM50063821
NameBDBM50063821
Synonyms:CHEMBL414254 H-DNal-cyclo[DCys-Tyr-DTrp-Lys-Val-Cys]-Thr-NH2 | Lanreotide
TypeSmall organic molecule
Emp. Form.C54H69N11O10S2
Mol. Mass.1096.323
SMILESCC(C)[C@@H]1NC(=O)[C@@H](CCCCN)NC(=O)[C@H](Cc2c[nH]c3ccccc23)NC(=O)[C@@H](Cc2ccc(O)cc2)NC(=O)[C@@H](CSSC[C@H](NC1=O)C(=O)N[C@@H](C(C)O)C(N)=O)NC(=O)[C@H](N)Cc1ccc2ccccc2c1