Reaction Details
TargetNeuropeptide Y receptor type 1
LigandBDBM85535
Substrate/Competitorn/a
Ki 0.8±n/a nM
CommentsPDSP_6857
Citation Berglund, MMHolmberg, SKEriksson, HGedda, KMaffrand, JPSerradeil-Le Gal, CChhajlani, VGrundemar, LLarhammar, D The cloned guinea pig neuropeptide Y receptor Y1 conforms to other mammalian Y1 receptors. Peptides20:1043-53 (1999) 
 
Neuropeptide Y receptor type 1
Name:Neuropeptide Y receptor type 1
Type:Enzyme Catalytic Domain
Mol. Mass.:44288.14
Organism:GUINEA PIG
Description:NPY-Y1 NPY1R GUINEA PIG::Q9WVD0
Residue:383
BDBM85535
NameBDBM85535
Synonyms:CAS_5312150 | SR 120819A
TypeSmall organic molecule
Emp. Form.C43H54N6O4S
Mol. Mass.750.992
SMILESCN(C)CC1CCC(CN=C(N)c2ccc(CC(NC(=O)C(Cc3ccccc3)NS(=O)(=O)c3ccc4ccccc4c3)C(=O)N3CCCC3)cc2)CC1