Reaction Details
TargetDelta-type opioid receptor
LigandBDBM85541
Substrate/Competitorn/a
Ki 1.41±n/a nM
CommentsPDSP_434
Citation Traynor, JRGuo, LCoop, ALewis, JWWoods, JH Ring-constrained orvinols as analogs of buprenorphine: differences in opioid activity related to configuration of C(20) hydroxyl group. J Pharmacol Exp Ther291:1093-9 (1999) Delta-type opioid receptor
Name:Delta-type opioid receptor
Type:Enzyme Catalytic Domain
Mol. Mass.:40577.25
Organism:MOUSE
Description:P32300
Residue:372
BDBM85541
NameBDBM85541
Synonyms:BU 95 | BU-95
TypeSmall organic molecule
Emp. Form.C28H35NO4
Mol. Mass.449.5818
SMILESCOC12C=C[C@]3(C4[C@@H](O)C(C)(C)CC14)[C@H]1Cc4ccc(O)c5O[C@@H]2[C@]3(CCN1CC1CC1)c45