Reaction Details
TargetKappa-type opioid receptor
LigandBDBM85537
Substrate/Competitorn/a
Ki 1.02±n/a nM
CommentsPDSP_431
Citation Traynor, JRGuo, LCoop, ALewis, JWWoods, JH Ring-constrained orvinols as analogs of buprenorphine: differences in opioid activity related to configuration of C(20) hydroxyl group. J Pharmacol Exp Ther291:1093-9 (1999) Kappa-type opioid receptor
Name:Kappa-type opioid receptor
Type:Enzyme
Mol. Mass.:42656.78
Organism:Mus musculus (Mouse)
Description:P33534
Residue:380
BDBM85537
NameBDBM85537
Synonyms:BU 46 | BU-46
TypeSmall organic molecule
Emp. Form.C26H31NO4
Mol. Mass.421.5286
SMILESCOC12C=C[C@]3(C4[C@H](O)CCC14)[C@H]1Cc4ccc(O)c5O[C@@H]2[C@]3(CCN1CC1CC1)c45