Reaction Details
TargetAngiotensin-converting enzyme 2
LigandBDBM85555
Substrate/Competitorn/a
Ki 1000±n/a nM
CommentsPDSP_304
Citation Handa, RKHarding, JWSimasko, SM Characterization and function of the bovine kidney epithelial angiotensin receptor subtype 4 using angiotensin IV and divalinal angiotensin IV as receptor ligands. J Pharmacol Exp Ther291:1242-9 (1999) Angiotensin-converting enzyme 2
Name:Angiotensin-converting enzyme 2
Type:Enzyme Catalytic Domain
Mol. Mass.:93046.63
Organism:BOVINE
Description:Angiotensin IV 0 BOVINE::Q58DD0
Residue:804
BDBM85555
NameBDBM85555
Synonyms:Ang II Ile8, Sar1
TypeSmall organic molecule
Emp. Form.C46H73N13O10
Mol. Mass.968.1529
SMILESCCC(C)[C@H](NC(=O)[C@@H]1CCCN1C(=O)[C@H](Cc1cnc[nH]1)NC(=O)[C@@H](NC(=O)[C@H](Cc1ccc(O)cc1)NC(=O)[C@@H](NC(=O)[C@H](CCCN=C(N)N)NC(=O)CNC)C(C)C)[C@@H](C)CC)C(O)=O