Reaction Details
TargetAngiotensin-converting enzyme 2
LigandBDBM85559
Substrate/Competitorn/a
Ki 1000±n/a nM
CommentsPDSP_305
Citation Handa, RKHarding, JWSimasko, SM Characterization and function of the bovine kidney epithelial angiotensin receptor subtype 4 using angiotensin IV and divalinal angiotensin IV as receptor ligands. J Pharmacol Exp Ther291:1242-9 (1999) Angiotensin-converting enzyme 2
Name:Angiotensin-converting enzyme 2
Type:Enzyme Catalytic Domain
Mol. Mass.:93046.63
Organism:BOVINE
Description:Angiotensin IV 0 BOVINE::Q58DD0
Residue:804
BDBM85559
NameBDBM85559
Synonyms:Ang II Thr8, Sar1
TypeSmall organic molecule
Emp. Form.C44H69N13O11
Mol. Mass.956.0992
SMILESCC[C@H](C)[C@H](NC(=O)[C@H](Cc1ccc(O)cc1)NC(=O)[C@@H](NC(=O)[C@H](CCCN=C(N)N)NC(=O)CNC)C(C)C)C(=O)N[C@@H](Cc1cnc[nH]1)C(=O)N1CCC[C@H]1C(=O)N[C@@H](C(C)O)C(O)=O