Reaction Details
TargetAngiotensin-converting enzyme 2
LigandBDBM85550
Substrate/Competitorn/a
Ki 5.54±n/a nM
CommentsPDSP_307
Citation Handa, RKHarding, JWSimasko, SM Characterization and function of the bovine kidney epithelial angiotensin receptor subtype 4 using angiotensin IV and divalinal angiotensin IV as receptor ligands. J Pharmacol Exp Ther291:1242-9 (1999) Angiotensin-converting enzyme 2
Name:Angiotensin-converting enzyme 2
Type:Enzyme Catalytic Domain
Mol. Mass.:93046.63
Organism:BOVINE
Description:Angiotensin IV 0 BOVINE::Q58DD0
Residue:804
BDBM85550
NameBDBM85550
Synonyms:Ang IV CHEMBL261120 | cid_123814
TypeSmall organic molecule
Emp. Form.C40H54N8O8
Mol. Mass.774.9056
SMILESCC[C@H](C)[C@H](NC(=O)[C@H](Cc1ccc(O)cc1)NC(=O)[C@@H](N)C(C)C)C(=O)N[C@@H](Cc1cnc[nH]1)C(=O)N1CCC[C@H]1C(=O)N[C@@H](Cc1ccccc1)C(O)=O