Reaction Details
TargetAngiotensin-converting enzyme 2
LigandBDBM85544
Substrate/Competitorn/a
Ki 117±n/a nM
CommentsPDSP_314
Citation Handa, RKHarding, JWSimasko, SM Characterization and function of the bovine kidney epithelial angiotensin receptor subtype 4 using angiotensin IV and divalinal angiotensin IV as receptor ligands. J Pharmacol Exp Ther291:1242-9 (1999) Angiotensin-converting enzyme 2
Name:Angiotensin-converting enzyme 2
Type:Enzyme Catalytic Domain
Mol. Mass.:93046.63
Organism:BOVINE
Description:Angiotensin IV 0 BOVINE::Q58DD0
Residue:804
BDBM85544
NameBDBM85544
Synonyms:Ang(3-11)
TypeSmall organic molecule
Emp. Form.C56H78N12O12
Mol. Mass.1111.2917
SMILESCC[C@H](C)[C@H](NC(=O)[C@H](Cc1ccc(O)cc1)NC(=O)[C@@H](N)C(C)C)C(=O)O[C@@H](Cc1cnc[nH]1)C(=O)N1CCC[C@H]1C(=O)N[C@@H](Cc1ccccc1)C(=O)N[C@@H](C(=O)N[C@@H](CC(C)C)C(=O)N[C@H](C(C)C)C(O)=O)c1cnc[nH]1