Reaction Details
TargetAngiotensin-converting enzyme 2
LigandBDBM85542
Substrate/Competitorn/a
Ki 4.07±n/a nM
CommentsPDSP_680
Citation Handa, RKHarding, JWSimasko, SM Characterization and function of the bovine kidney epithelial angiotensin receptor subtype 4 using angiotensin IV and divalinal angiotensin IV as receptor ligands. J Pharmacol Exp Ther291:1242-9 (1999) Angiotensin-converting enzyme 2
Name:Angiotensin-converting enzyme 2
Type:Enzyme Catalytic Domain
Mol. Mass.:93046.63
Organism:BOVINE
Description:Angiotensin IV 0 BOVINE::Q58DD0
Residue:804
BDBM85542
NameBDBM85542
Synonyms:Divalinal Ang IV
TypeSmall organic molecule
Emp. Form.C39H56N8O6
Mol. Mass.732.9119
SMILESCC(C)[C@H](N)CN[C@@H](Cc1ccc(O)cc1)C(=O)N[C@H](CN[C@@H](Cc1cnc[nH]1)C(=O)CN1CCCC1C(=O)NC(C(O)=O)c1ccccc1)C(C)C