Reaction Details
TargetSomatostatin receptor type 1
LigandBDBM82253
Substrate/Competitorn/a
Ki 4.26±n/a nM
CommentsPDSP_382
Citation Siehler, SSeuwen, KHoyer, D Characterisation of human recombinant somatostatin receptors. 1. Radioligand binding studies. Naunyn Schmiedebergs Arch Pharmacol360:488-99 (1999) 
 
Somatostatin receptor type 1
Name:Somatostatin receptor type 1
Type:Enzyme
Mol. Mass.:42692.81
Organism:Homo sapiens (Human)
Description:P30872
Residue:391
BDBM82253
NameBDBM82253
Synonyms:BIM 23052 | CAS_133073-82-2
TypeSmall organic molecule
Emp. Form.C61H75N11O10
Mol. Mass.1122.3159
SMILESC[C@@H](O)[C@H](NC(=O)[C@H](Cc1ccccc1)NC(=O)[C@@H](NC(=O)[C@H](CCCCN)NC(=O)[C@@H](Cc1c[nH]c2ccccc12)NC(=O)[C@H](Cc1ccccc1)NC(=O)[C@H](Cc1ccccc1)NC(=O)[C@H](N)Cc1ccccc1)[C@@H](C)O)C(N)=O