Reaction Details
TargetSomatostatin receptor type 1
LigandBDBM85248
Substrate/Competitorn/a
Ki 1.73±n/a nM
CommentsPDSP_588
Citation Siehler, SSeuwen, KHoyer, D Characterisation of human recombinant somatostatin receptors. 1. Radioligand binding studies. Naunyn Schmiedebergs Arch Pharmacol360:488-99 (1999) 
 
Somatostatin receptor type 1
Name:Somatostatin receptor type 1
Type:Enzyme
Mol. Mass.:42692.81
Organism:Homo sapiens (Human)
Description:P30872
Residue:391
BDBM85248
NameBDBM85248
Synonyms:CST14 | Cortistatin(1-14)
TypeSmall organic molecule
Emp. Form.C81H115N19O19S2
Mol. Mass.1723.026
SMILESC[C@@H](O)[C@H](NC(=O)[C@H](CCCCN)NC(=O)[C@H](Cc1c[nH]c2ccccc12)NC(=O)[C@H](Cc1ccccc1)NC(=O)[C@H](Cc1ccccc1)NC(=O)[C@H](CC(N)=O)NC(=O)[C@H](CCCCN)NC(=O)[C@H](CS)NC(=O)[C@@H]1CCCN1)C(=O)N[C@@H](Cc1ccccc1)C(=O)N[C@@H](CO)C(=O)N[C@@H](CO)C(=O)N[C@@H](CS)C(=O)N[C@@H](CCCCN)C(O)=O