Reaction Details
TargetSomatostatin receptor type 2
LigandBDBM82464
Substrate/Competitorn/a
Ki 0.27±n/a nM
CommentsPDSP_1591
Citation Siehler, SSeuwen, KHoyer, D Characterisation of human recombinant somatostatin receptors. 1. Radioligand binding studies. Naunyn Schmiedebergs Arch Pharmacol360:488-99 (1999) 
 
Somatostatin receptor type 2
Name:Somatostatin receptor type 2
Type:Enzyme
Mol. Mass.:41344.94
Organism:Homo sapiens (Human)
Description:P30874
Residue:369
BDBM82464
NameBDBM82464
Synonyms:CAS_71306 RC 160 | Vapreotide
TypeSmall organic molecule
Emp. Form.C57H70N12O9S2
Mol. Mass.1131.371
SMILESCC(C)C1NC(=O)C(CCCCN)NC(=O)C(Cc2c[nH]c3ccccc23)NC(=O)C(Cc2ccc(O)cc2)NC(=O)C(CSSCC(NC1=O)C(=O)NC(Cc1c[nH]c2ccccc12)C(N)=O)NC(=O)C(N)Cc1ccccc1