Reaction Details
TargetSomatostatin receptor type 5
LigandBDBM82456
Substrate/Competitorn/a
Ki 954.99±n/a nM
CommentsPDSP_376
Citation Siehler, SSeuwen, KHoyer, D Characterisation of human recombinant somatostatin receptors. 1. Radioligand binding studies. Naunyn Schmiedebergs Arch Pharmacol360:488-99 (1999) 
 
Somatostatin receptor type 5
Name:Somatostatin receptor type 5
Type:Enzyme
Mol. Mass.:39218.02
Organism:Homo sapiens (Human)
Description:P35346
Residue:364
BDBM82456
NameBDBM82456
Synonyms:BIM 23030 | CAS_117580-24-2
TypeSmall organic molecule
Emp. Form.C45H57N9O8S2
Mol. Mass.916.12
SMILESCC(C)[C@@H]1NC(=O)[C@H](CCCCN)NC(=O)[C@@H](Cc2c[nH]c3ccccc23)NC(=O)[C@H](Cc2ccc(O)cc2)NC(=O)CCSSC(NC1=O)C(=O)N[C@@H](Cc1ccccc1)C(N)=O