Reaction Details
Target5-hydroxytryptamine receptor 4
LigandBDBM50005836
Substrate/Competitorn/a
Ki 100±n/a nM
CommentsPDSP_530
Citation Bender, EPindon, Avan Oers, IZhang, YBGommeren, WVerhasselt, PJurzak, MLeysen, JLuyten, W Structure of the human serotonin 5-HT4 receptor gene and cloning of a novel 5-HT4 splice variant. J Neurochem74:478-89 (2000) 
 
5-hydroxytryptamine receptor 4
Name:5-hydroxytryptamine receptor 4
Type:Enzyme
Mol. Mass.:43767.54
Organism:Homo sapiens (Human)
Description:Q13639
Residue:388
BDBM50005836
NameBDBM50005836
Synonyms:4-Amino-5-chloro-N-{1-[3-(4-fluoro-phenoxy)-propyl]-3-methoxy-piperidin-4-yl}-2-methoxy-benzamide CHEMBL560739 PROPULSID US10800776, Example Cisapride cid_5311047
TypeSmall organic molecule
Emp. Form.C23H29ClFN3O4
Mol. Mass.465.945
SMILESCOC1CN(CCCOc2ccc(F)cc2)CCC1NC(=O)c1cc(Cl)c(N)cc1OC