Reaction Details
Target5-hydroxytryptamine receptor 1A
LigandBDBM50130279
Substrate/Competitorn/a
Ki 1000±n/a nM
CommentsPDSP_3796
Citation Lovell, PJBromidge, SMDabbs, SDuckworth, DMForbes, ITJennings, AJKing, FDMiddlemiss, DNRahman, SKSaunders, DVCollin, LLHagan, JJRiley, GJThomas, DR A novel, potent, and selective 5-HT(7) antagonist: (R)-3-(2-(2-(4-methylpiperidin-1-yl)ethyl)pyrrolidine-1-sulfonyl) phen ol (SB-269970). J Med Chem43:342-5 (2000) 
 
5-hydroxytryptamine receptor 1A
Name:5-hydroxytryptamine receptor 1A
Type:n/a
Mol. Mass.:46122.49
Organism:Homo sapiens (Human)
Description:n/a
Residue:422
BDBM50130279
NameBDBM50130279
Synonyms:(R)-4-Methyl-1-(2-(1-toluene-3-sulfonyl)-pyrrolidin-2-yl)-ethyl)-piperidine (Oxalate salt) 4-Methyl-1-{2-[(S)-1-(toluene-3-sulfonyl)-pyrrolidin-2-yl]-ethyl}-piperidine CHEMBL12624 | SB-258741
TypeSmall organic molecule
Emp. Form.C19H30N2O2S
Mol. Mass.350.519
SMILESCC1CCN(CC[C@H]2CCCN2S(=O)(=O)c2cccc(C)c2)CC1