Reaction Details
Target5-hydroxytryptamine receptor 7
LigandBDBM85611
Substrate/Competitorn/a
Ki 398.11±n/a nM
CommentsPDSP_3794
Citation Lovell, PJBromidge, SMDabbs, SDuckworth, DMForbes, ITJennings, AJKing, FDMiddlemiss, DNRahman, SKSaunders, DVCollin, LLHagan, JJRiley, GJThomas, DR A novel, potent, and selective 5-HT(7) antagonist: (R)-3-(2-(2-(4-methylpiperidin-1-yl)ethyl)pyrrolidine-1-sulfonyl) phen ol (SB-269970). J Med Chem43:342-5 (2000) 
 
5-hydroxytryptamine receptor 7
Name:5-hydroxytryptamine receptor 7
Type:G Protein-Coupled Receptor (GPCR)
Mol. Mass.:53573.08
Organism:Homo sapiens (Human)
Description:P34969
Residue:479
BDBM85611
NameBDBM85611
Synonyms:(S)-4-Methyl-1-(2-(1-(naphthalene-1-sulfonyl)-piperidin-2-yl)-ethyl)-piperidine(5)
TypeSmall organic molecule
Emp. Form.C24H33NO2S
Mol. Mass.399.589
SMILES[#6]-[#6]-1-[#6]-[#6]-[#7](-[#6]-[#6]-[#6@@H]-2-[#6]-[#6]-[#6]-[#6]-[#6]-2[S;v6](=O)(=O)c2cccc3ccccc23)-[#6]-[#6]-1