Reaction Details
TargetCannabinoid receptor 2
LigandBDBM21282
Substrate/Competitorn/a
Ki 269±n/a nM
CommentsPDSP_1001
Citation Griffin, GTao, QAbood, ME Cloning and pharmacological characterization of the rat CB(2) cannabinoid receptor. J Pharmacol Exp Ther292:886-94 (2000) Cannabinoid receptor 2
Name:Cannabinoid receptor 2
Type:Enzyme
Mol. Mass.:39366.68
Organism:Rattus norvegicus (Rat)
Description:Q9QZN9
Residue:360
BDBM21282
NameBDBM21282
Synonyms:2-methyl-3-(naphthalen-1-ylcarbonyl)-1-propyl-1H-indole JWH-015
Typen/a
Emp. Form.C23H21NO
Mol. Mass.327.4189
SMILESCCCn1c(C)c(C(=O)c2cccc3ccccc23)c2ccccc12