Reaction Details
TargetNicotinic acetylcholine receptor
LigandBDBM86231
Substrate/Competitorn/a
Ki>10000±n/a nM
CommentsPDSP_334
Citation Mukhin, AGGündisch, DHorti, AGKoren, AOTamagnan, GKimes, ASChambers, JVaupel, DBKing, SLPicciotto, MRInnis, RBLondon, ED 5-Iodo-A-85380, an alpha4beta2 subtype-selective ligand for nicotinic acetylcholine receptors. Mol Pharmacol57:642-9 (2000) 
 
Nicotinic acetylcholine receptor
Name:Nicotinic acetylcholine receptor
Type:Enzyme Catalytic Domain
Mol. Mass.:2478.99
Organism:RAT
Description:n-AChR 0 RAT::Q62594
Residue:23
BDBM86231
NameBDBM86231
Synonyms:ATR Atropine,(-) CHEMBL195 US9333195, ATROPINE
TypeSmall organic molecule
Emp. Form.C17H23NO3
Mol. Mass.289.3694
SMILESCN1C2CCC1CC(C2)OC(=O)C(CO)c1ccccc1