Reaction Details
TargetNicotinic acetylcholine receptor
LigandBDBM50121739
Substrate/Competitorn/a
Ki 2500±n/a nM
CommentsPDSP_440
Citation Mukhin, AGGündisch, DHorti, AGKoren, AOTamagnan, GKimes, ASChambers, JVaupel, DBKing, SLPicciotto, MRInnis, RBLondon, ED 5-Iodo-A-85380, an alpha4beta2 subtype-selective ligand for nicotinic acetylcholine receptors. Mol Pharmacol57:642-9 (2000) 
 
Nicotinic acetylcholine receptor
Name:Nicotinic acetylcholine receptor
Type:Enzyme Catalytic Domain
Mol. Mass.:2478.99
Organism:RAT
Description:n-AChR 0 RAT::Q62594
Residue:23
BDBM50121739
NameBDBM50121739
Synonyms:Bungarotoxin Neuronal CHEMBL216458 | alpha-bungarotoxin
TypeSmall organic molecule
Emp. Form.C50H70O14
Mol. Mass.895.0824
SMILESC[C@@H]1C[C@@H]2O[C@@H]3C[C@@H]4OC(=O)C=C(C)[C@H]4O[C@@]3(C)C[C@H]2O[C@H]2CC[C@@]3(C)O[C@@]4(C)C[C@H]5O[C@H]6C[C@H]7O[C@@]8(C)[C@@H](O)C[C@H](CC(=C)C=O)O[C@@H]8C[C@@H]7O[C@@H]6\C=C/C[C@]5(C)O[C@@H]4C[C@@H]3O[C@H]12