Reaction Details
TargetNicotinic acetylcholine receptor
LigandBDBM50022772
Substrate/Competitorn/a
Ki>10000±n/a nM
CommentsPDSP_648
Citation Mukhin, AGGündisch, DHorti, AGKoren, AOTamagnan, GKimes, ASChambers, JVaupel, DBKing, SLPicciotto, MRInnis, RBLondon, ED 5-Iodo-A-85380, an alpha4beta2 subtype-selective ligand for nicotinic acetylcholine receptors. Mol Pharmacol57:642-9 (2000) 
 
Nicotinic acetylcholine receptor
Name:Nicotinic acetylcholine receptor
Type:Enzyme Catalytic Domain
Mol. Mass.:2478.99
Organism:RAT
Description:n-AChR 0 RAT::Q62594
Residue:23
BDBM50022772
NameBDBM50022772
Synonyms:CHEMBL1025 Diisopropyl fluorophosphonate Diisopropyl phosphorofluoridate Diisopropylfluorophosphoric acid ester Fluorodiisopropyl phosphate Isofluorphate Isopropyl fluophosphate Neoglaucit bis(propan-2-yl) fluorophosphate | diisopropyl fluorophosphate
TypeSmall organic molecule
Emp. Form.C6H14FO3P
Mol. Mass.184.1457
SMILESCC(C)OP(F)(=O)OC(C)C