Reaction Details
TargetNicotinic acetylcholine receptor
LigandBDBM10608
Substrate/Competitorn/a
Ki>10000±n/a nM
CommentsPDSP_1489
Citation Mukhin, AGGündisch, DHorti, AGKoren, AOTamagnan, GKimes, ASChambers, JVaupel, DBKing, SLPicciotto, MRInnis, RBLondon, ED 5-Iodo-A-85380, an alpha4beta2 subtype-selective ligand for nicotinic acetylcholine receptors. Mol Pharmacol57:642-9 (2000) 
 
Nicotinic acetylcholine receptor
Name:Nicotinic acetylcholine receptor
Type:Enzyme Catalytic Domain
Mol. Mass.:2478.99
Organism:RAT
Description:n-AChR 0 RAT::Q62594
Residue:23
BDBM10608
NameBDBM10608
Synonyms:(-)-physostigmine CHEMBL306319 Physostigmine Carbamate 15a
TypeSmall organic molecule
Emp. Form.C15H21N3O2
Mol. Mass.275.3461
SMILESCNC(=O)Oc1ccc2N(C)C3N(C)CC[C@@]3(C)c2c1