Reaction Details
TargetSodium-dependent dopamine transporter
LigandBDBM22167
Substrate/Competitorn/a
Ki 1.18±n/a nM
CommentsPDSP_871
Citation Letchworth, SRSmith, HRPorrino, LJBennett, BADavies, HMSexton, TChilders, SR Characterization of a tropane radioligand, [(3)H]2beta-propanoyl-3beta-(4-tolyl) tropane ([(3)H]PTT), for dopamine transport sites in rat brain. J Pharmacol Exp Ther293:686-96 (2000) Sodium-dependent dopamine transporter
Name:Sodium-dependent dopamine transporter
Type:Multi-pass membrane protein
Mol. Mass.:68749.45
Organism:Rattus norvegicus (rat)
Description:P23977
Residue:619
BDBM22167
NameBDBM22167
Synonyms:1-[2-(diphenylmethoxy)ethyl]-4-(3-phenylpropyl)piperazine CHEMBL434080 GBR-12935
TypeSmall organic molecule
Emp. Form.C28H34N2O
Mol. Mass.414.5824
SMILESC(CN1CCN(CCOC(c2ccccc2)c2ccccc2)CC1)Cc1ccccc1