Reaction Details
TargetSodium-dependent dopamine transporter
LigandBDBM50041293
Substrate/Competitorn/a
Ki 0.65±n/a nM
CommentsPDSP_1957
Citation Letchworth, SRSmith, HRPorrino, LJBennett, BADavies, HMSexton, TChilders, SR Characterization of a tropane radioligand, [(3)H]2beta-propanoyl-3beta-(4-tolyl) tropane ([(3)H]PTT), for dopamine transport sites in rat brain. J Pharmacol Exp Ther293:686-96 (2000) Sodium-dependent dopamine transporter
Name:Sodium-dependent dopamine transporter
Type:Multi-pass membrane protein
Mol. Mass.:68749.45
Organism:Rattus norvegicus (rat)
Description:P23977
Residue:619
BDBM50041293
NameBDBM50041293
Synonyms:1-(8-Methyl-3-naphthalen-2-yl-8-aza-bicyclo[3.2.1]oct-2-yl)-propan-1-one WF-23
TypeSmall organic molecule
Emp. Form.C21H25NO
Mol. Mass.307.4293
SMILESCCC(=O)C1C2CCC(CC1c1ccc3ccccc3c1)N2C