Reaction Details
TargetAdenosine receptor A3
LigandBDBM50034171
Substrate/Competitorn/a
Ki 1.2±n/a nM
CommentsPDSP_947
Citation Varani, KMerighi, SGessi, SKlotz, KNLeung, EBaraldi, PGCacciari, BRomagnoli, RSpalluto, GBorea, PA [(3)H]MRE 3008F20: a novel antagonist radioligand for the pharmacological and biochemical characterization of human A(3) adenosine receptors. Mol Pharmacol57:968-75 (2000) Adenosine receptor A3
Name:Adenosine receptor A3
Type:G Protein-Coupled Receptor (GPCR)
Mol. Mass.:36197.32
Organism:Homo sapiens (Human)
Description:P0DMS8
Residue:318
BDBM50034171
NameBDBM50034171
Synonyms:3,4-Dihydroxy-5-[6-(3-iodo-benzylamino)-purin-9-yl]-tetrahydro-furan-2-carboxylic acid methylamide IB-MECA
TypeSmall organic molecule
Emp. Form.C18H19IN6O4
Mol. Mass.510.2857
SMILESCNC(=O)C1OC(C(O)C1O)n1cnc2c(NCc3cccc(I)c3)ncnc12