Reaction Details
TargetCarbonic anhydrase 9
LigandBDBM10886
Substrate/Competitorn/a
Meas. Tech.CA Assay
pH7.4±0
Temperature293.15±0 K
Ki 45±0.0 nM
Citation Supuran, CTScozzafava, A Benzolamide is not a membrane-impermeant carbonic anhydrase inhibitor. J Enzyme Inhib Med Chem19:269-73 (2004) 
 
Carbonic anhydrase 9
Name:Carbonic anhydrase 9
Type:Enzyme
Mol. Mass.:49669.03
Organism:Homo sapiens (Human)
Description:Catalytic domain of human cloned isozyme was used in the assay
Residue:459
BDBM10886
NameBDBM10886
Synonyms:2-N-benzene-1,3,4-thiadiazole-2,5-disulfonamide Benzolamide CHEMBL73962
TypeSmall organic molecule
Emp. Form.C8H8N4O4S3
Mol. Mass.320.369
SMILESNS(=O)(=O)c1nnc(NS(=O)(=O)c2ccccc2)s1