Reaction Details
Target5-hydroxytryptamine receptor 2C
LigandBDBM78433
Substrate/Competitorn/a
Ki 579±n/a nM
CommentsPDSP_837
Citation Herrick-Davis, KGrinde, ETeitler, M Inverse agonist activity of atypical antipsychotic drugs at human 5-hydroxytryptamine2C receptors. J Pharmacol Exp Ther295:226-32 (2000) 5-hydroxytryptamine receptor 2C
Name:5-hydroxytryptamine receptor 2C
Type:G Protein-Coupled Receptor (GPCR)
Mol. Mass.:51836.79
Organism:Homo sapiens (Human)
Description:P28335
Residue:458
BDBM78433
NameBDBM78433
Synonyms:2-[4-[3-[2-(trifluoromethyl)-10-phenothiazinyl]propyl]-1-piperazinyl]ethanol;hydrochloride 2-[4-[3-[2-(trifluoromethyl)phenothiazin-10-yl]propyl]piperazino]ethanol;hydrochloride FLUPHENAZINE HYDROCHLORIDE SMR000058411 cid_6602611 | med.21724, Compound 17
TypeSmall organic molecule
Emp. Form.C22H26F3N3OS
Mol. Mass.437.522
SMILESOCCN1CCN(CCCN2c3ccccc3Sc3ccc(cc23)C(F)(F)F)CC1