Reaction Details
Target5-hydroxytryptamine receptor 2C
LigandBDBM50026066
Substrate/Competitorn/a
Ki 2079±n/a nM
CommentsPDSP_1448
Citation Herrick-Davis, KGrinde, ETeitler, M Inverse agonist activity of atypical antipsychotic drugs at human 5-hydroxytryptamine2C receptors. J Pharmacol Exp Ther295:226-32 (2000) 5-hydroxytryptamine receptor 2C
Name:5-hydroxytryptamine receptor 2C
Type:G Protein-Coupled Receptor (GPCR)
Mol. Mass.:51836.79
Organism:Homo sapiens (Human)
Description:P28335
Residue:458
BDBM50026066
NameBDBM50026066
Synonyms:1-(4,4-bis(4-fluorophenyl)butyl)-4-(4-chloro-3-(trifluoromethyl)phenyl)piperidin-4-ol CHEMBL47050 Penfluridol
TypeSmall organic molecule
Emp. Form.C28H27ClF5NO
Mol. Mass.523.965
SMILESOC1(CCN(CCCC(c2ccc(F)cc2)c2ccc(F)cc2)CC1)c1ccc(Cl)c(c1)C(F)(F)F