Reaction Details
Target5-hydroxytryptamine receptor 2C
LigandBDBM81770
Substrate/Competitorn/a
Ki 151±n/a nM
CommentsPDSP_1797
Citation Herrick-Davis, KGrinde, ETeitler, M Inverse agonist activity of atypical antipsychotic drugs at human 5-hydroxytryptamine2C receptors. J Pharmacol Exp Ther295:226-32 (2000) 5-hydroxytryptamine receptor 2C
Name:5-hydroxytryptamine receptor 2C
Type:G Protein-Coupled Receptor (GPCR)
Mol. Mass.:51836.79
Organism:Homo sapiens (Human)
Description:P28335
Residue:458
BDBM81770
NameBDBM81770
Synonyms:CAS_82650-83-7 TENILAPINE
TypeSmall organic molecule
Emp. Form.C17H16N4S2
Mol. Mass.340.466
SMILESCN1CCN(CC1)C1=Nc2cscc2C(=CC#N)c2cscc12