Reaction Details
TargetCannabinoid receptor 1
LigandBDBM50000729
Substrate/Competitorn/a
Ki 37±n/a nM
CommentsPDSP_1806
Citation Breivogel, CSChilders, SR Cannabinoid agonist signal transduction in rat brain: comparison of cannabinoid agonists in receptor binding, G-protein activation, and adenylyl cyclase inhibition. J Pharmacol Exp Ther295:328-36 (2000) Cannabinoid receptor 1
Name:Cannabinoid receptor 1
Type:G Protein-Coupled Receptor (GPCR)
Mol. Mass.:52856.55
Organism:Rattus norvegicus (rat)
Description:P20272
Residue:473
BDBM50000729
NameBDBM50000729
Synonyms:(+)-6,6,9-Trimethyl-3-pentyl-6a,7,8,10a-tetrahydro-6H-benzo[c]chromen-1-ol 6,6,9-Trimethyl-3-pentyl-6a,7,8,10a-tetrahydro-6H-benzo[c]chromen-1-ol THC, delta 9 | Tetrahydrocannabinol
TypeSmall organic molecule
Emp. Form.C21H30O2
Mol. Mass.314.4617
SMILESCCCCCc1cc(O)c2C3C=C(C)CC[C@H]3C(C)(C)Oc2c1