Reaction Details
TargetLeukotriene B4 receptor 1
LigandBDBM85702
Substrate/Competitorn/a
Ki 3.7±n/a nM
CommentsPDSP_1109
Citation Wang, SGustafson, EPang, LQiao, XBehan, JMaguire, MBayne, MLaz, T A novel hepatointestinal leukotriene B4 receptor. Cloning and functional characterization. J Biol Chem275:40686-94 (2000) 
 
Leukotriene B4 receptor 1
Name:Leukotriene B4 receptor 1
Type:Enzyme Catalytic Domain
Mol. Mass.:37582.68
Organism:Homo sapiens (Human)
Description:Q15722
Residue:352
BDBM85702
NameBDBM85702
Synonyms:CAS_5283125 NSC_5283125
TypeSmall organic molecule
Emp. Form.C20H30O4
Mol. Mass.334.4498
SMILESCCC=CCC=CCC(O)C=CC=CC=CC(O)CCCC(O)=O