Reaction Details
TargetLeukotriene B4 receptor 1
LigandBDBM79408
Substrate/Competitorn/a
Ki 25±n/a nM
CommentsPDSP_1937
Citation Wang, SGustafson, EPang, LQiao, XBehan, JMaguire, MBayne, MLaz, T A novel hepatointestinal leukotriene B4 receptor. Cloning and functional characterization. J Biol Chem275:40686-94 (2000) 
 
Leukotriene B4 receptor 1
Name:Leukotriene B4 receptor 1
Type:Enzyme Catalytic Domain
Mol. Mass.:37582.68
Organism:Homo sapiens (Human)
Description:Q15722
Residue:352
BDBM79408
NameBDBM79408
Synonyms:(5R)-6-[6-[(1E,3S,5Z)-3-hydroxyundeca-1,5-dienyl]-2-pyridinyl]hexane-1,5-diol (5R)-6-[6-[(1E,3S,5Z)-3-hydroxyundeca-1,5-dienyl]pyridin-2-yl]hexane-1,5-diol MLS000028864 U-75302 | cid_6852392
TypeSmall organic molecule
Emp. Form.C22H35NO3
Mol. Mass.361.5182
SMILESCCCCC\C=C/C[C@H](O)\C=C\c1cccc(C[C@H](O)CCCCO)n1