Reaction Details
TargetLeukotriene B4 receptor 2
LigandBDBM85699
Substrate/Competitorn/a
Ki 1000±n/a nM
CommentsPDSP_125
Citation Wang, SGustafson, EPang, LQiao, XBehan, JMaguire, MBayne, MLaz, T A novel hepatointestinal leukotriene B4 receptor. Cloning and functional characterization. J Biol Chem275:40686-94 (2000) 
 
Leukotriene B4 receptor 2
Name:Leukotriene B4 receptor 2
Type:Enzyme Catalytic Domain
Mol. Mass.:37964.86
Organism:Homo sapiens (Human)
Description:Leukotriene 2 0 HUMAN::Q9NPC1
Residue:358
BDBM85699
NameBDBM85699
Synonyms:5, 6-Dehydroarachidonic acid NSC_1777
TypeSmall organic molecule
Emp. Form.C20H30O2
Mol. Mass.302.451
SMILESCCCCCC=CCC=CCC=CCC#CCCCC(O)=O