Reaction Details
TargetLeukotriene B4 receptor 2
LigandBDBM85703
Substrate/Competitorn/a
Ki 155±n/a nM
CommentsPDSP_799
Citation Wang, SGustafson, EPang, LQiao, XBehan, JMaguire, MBayne, MLaz, T A novel hepatointestinal leukotriene B4 receptor. Cloning and functional characterization. J Biol Chem275:40686-94 (2000) 
 
Leukotriene B4 receptor 2
Name:Leukotriene B4 receptor 2
Type:Enzyme Catalytic Domain
Mol. Mass.:37964.86
Organism:Homo sapiens (Human)
Description:Leukotriene 2 0 HUMAN::Q9NPC1
Residue:358
BDBM85703
NameBDBM85703
Synonyms:CAS_5283162 NSC_5283162
TypeSmall organic molecule
Emp. Form.C20H30O3
Mol. Mass.318.4504
SMILESCCCCCCC=CC(=O)C=CC=CCC=CCCCC(O)=O