Reaction Details
TargetLeukotriene B4 receptor 2
LigandBDBM50024447
Substrate/Competitorn/a
Ki 1000±n/a nM
CommentsPDSP_921
Citation Wang, SGustafson, EPang, LQiao, XBehan, JMaguire, MBayne, MLaz, T A novel hepatointestinal leukotriene B4 receptor. Cloning and functional characterization. J Biol Chem275:40686-94 (2000) 
 
Leukotriene B4 receptor 2
Name:Leukotriene B4 receptor 2
Type:Enzyme Catalytic Domain
Mol. Mass.:37964.86
Organism:Homo sapiens (Human)
Description:Leukotriene 2 0 HUMAN::Q9NPC1
Residue:358
BDBM50024447
NameBDBM50024447
Synonyms:(6E,8Z,11Z,14Z)-5-Hydroxy-icosa-6,8,11,14-tetraenoic acid CHEMBL17695 HETE-5(S)
TypeSmall organic molecule
Emp. Form.C20H32O3
Mol. Mass.320.4663
SMILESCCCCC\C=C/C\C=C/C\C=C/C=C/C(O)CCCC(O)=O